Target
Enoyl-[acyl-carrier-protein] reductase [NADH]
Ligand
BDBM50442997
Substrate
Meas. Tech.
ChEMBL_1276822 (CHEMBL3089490)
Kd
9300±n/a nM
Citation
 Shirude, PSMadhavapeddi, PNaik, MMurugan, KShinde, VNandishaiah, RBhat, JKumar, AHameed, SHoldgate, GDavies, GMcMiken, HHegde, NAmbady, AVenkatraman, JPanda, MBandodkar, BSambandamurthy, VKRead, JA Methyl-thiazoles: a novel mode of inhibition with the potential to develop novel inhibitors targeting InhA in Mycobacterium tuberculosis. J Med Chem 56:8533-42 (2013)  
Target
Name:
Enoyl-[acyl-carrier-protein] reductase [NADH]
Synonyms:
Enoyl-ACP Reductase (InhA) Enoyl-[acyl-carrier-protein] reductase [NADH] NADH-dependent enoyl-ACP reductase | inhA
Type:
Enzyme
Mol. Mass.:
28526.00
Organism:
Mycobacterium tuberculosis (strain ATCC 25618 / H37Rv)
Description:
P9WGR1
Residue:
269
  
Inhibitor
Name:
BDBM50442997
Synonyms:
CHEMBL3088172
Type:
Small organic molecule
Emp. Form.:
C18H16F2N6OS2
Mol. Mass.:
434.486
SMILES:
Cc1csc(n1)[C@](C)(O)c1nnc(Nc2ccn(Cc3c(F)cccc3F)n2)s1
: