Target
Acetylcholinesterase
Ligand
BDBM50443029
Substrate
Meas. Tech.
ChEMBL_1275664 (CHEMBL3090835)
Kd
9200±n/a nM
Citation
 Andersson, CDForsgren, NAkfur, CAllgardsson, ABerg, LEngdahl, CQian, WEkström, FLinusson, A Divergent structure-activity relationships of structurally similar acetylcholinesterase inhibitors. J Med Chem 56:7615-24 (2013)  
Target
Name:
Acetylcholinesterase
Synonyms:
ACES_MOUSE Acetylcholinesterase (mouse AChE) Ache
Type:
Enzyme
Mol. Mass.:
68165.65
Organism:
Mus musculus (mouse)
Description:
Residue:
614
  
Inhibitor
Name:
BDBM50443029
Synonyms:
CHEMBL3087809
Type:
Small organic molecule
Emp. Form.:
C14H21F3N2O2S
Mol. Mass.:
338.389
SMILES:
CCN(CC)CCNS(=O)(=O)Cc1ccc(cc1)C(F)(F)F
: