Target
Acetylcholinesterase
Ligand
BDBM50443031
Substrate
Meas. Tech.
ChEMBL_1275665 (CHEMBL3090836)
IC50
2500±n/a nM
Citation
 Andersson, CDForsgren, NAkfur, CAllgardsson, ABerg, LEngdahl, CQian, WEkström, FLinusson, A Divergent structure-activity relationships of structurally similar acetylcholinesterase inhibitors. J Med Chem 56:7615-24 (2013)  
Target
Name:
Acetylcholinesterase
Synonyms:
ACES_MOUSE Acetylcholinesterase (mouse AChE) Ache
Type:
Enzyme
Mol. Mass.:
68165.65
Organism:
Mus musculus (mouse)
Description:
Residue:
614
  
Inhibitor
Name:
BDBM50443031
Synonyms:
CHEMBL3087804
Type:
Small organic molecule
Emp. Form.:
C18H22ClN3O5S
Mol. Mass.:
427.902
SMILES:
CCN(CC)CCNS(=O)(=O)c1ccc(Oc2c(Cl)cccc2[N+]([O-])=O)cc1
: