Target
2-C-methyl-D-erythritol 2,4-cyclodiphosphate synthase
Ligand
BDBM50443773
Substrate
Meas. Tech.
ChEMBL_1280332 (CHEMBL3095347)
Kd
135000±n/a nM
Citation
 Zhang, ZJakkaraju, SBlain, JGogol, KZhao, LHartley, RCKarlsson, CAStaker, BLEdwards, TEStewart, LJMyler, PJClare, MBegley, DWHorn, JRHagen, TJ Cytidine derivatives as IspF inhibitors of Burkolderia pseudomallei. Bioorg Med Chem Lett 23:6860-3 (2013)  
Target
Name:
2-C-methyl-D-erythritol 2,4-cyclodiphosphate synthase
Synonyms:
ISPF_BURPS MECPP-synthase ispF | mecS
Type:
PROTEIN
Mol. Mass.:
17174.90
Organism:
Burkholderia pseudomallei (strain K96243)
Description:
ChEMBL_107981
Residue:
162
  
Inhibitor
Name:
BDBM50443773
Synonyms:
CHEMBL1230528
Type:
Small organic molecule
Emp. Form.:
C6H6N2OS
Mol. Mass.:
154.19
SMILES:
OCc1cn2ccsc2n1
: