Target
Carbonic anhydrase
Ligand
BDBM10880
Substrate
Meas. Tech.
ChEMBL_1280424 (CHEMBL3095736)
Ki
27±n/a nM
Citation
 Vullo, DSai Kumar, RSScozzafava, ACapasso, CFerry, JGSupuran, CT Anion inhibition studies of aß-carbonic anhydrase from Clostridium perfringens. Bioorg Med Chem Lett 23:6706-10 (2013)  
Target
Name:
Carbonic anhydrase
Synonyms:
Beta-carbonic anhydrase Carbonate dehydratase FbiCA1
Type:
Protein
Mol. Mass.:
35543.44
Organism:
Vibrio cholerae
Description:
P46510
Residue:
330
  
Inhibitor
Name:
BDBM10880
Synonyms:
AZA AZM acetazolamide Acetazolamide Acetazolamide (AZA) Acetazolamide, 5 Acetazolamide, AZA CHEMBL20 Sulfonamide, 1 US11278534, Example acetazolamide sulfonamide 1
Type:
Small organic molecule
Emp. Form.:
C4H6N4O3S2
Mol. Mass.:
222.245
SMILES:
CC(=O)Nc1nnc(s1)S(N)(=O)=O
: