Target
Polyunsaturated fatty acid 5-lipoxygenase
Ligand
BDBM50444319
Substrate
Meas. Tech.
ChEMBL_1278585 (CHEMBL3095266)
Ki
140000±n/a nM
Citation
 Wisastra, RKok, PAEleftheriadis, NBaumgartner, MPCamacho, CJHaisma, HJDekker, FJ Discovery of a novel activator of 5-lipoxygenase from an anacardic acid derived compound collection. Bioorg Med Chem 21:7763-78 (2013)  
Target
Name:
Polyunsaturated fatty acid 5-lipoxygenase
Synonyms:
5-LO 5-Lipoxygenase (5-LO) 5-Lipoygenase ALOX5 LOG5 | LOX5_HUMAN
Type:
Enzyme
Mol. Mass.:
77972.74
Organism:
Homo sapiens (Human)
Description:
Recombinant protein was purified from E. coli lysate. After ammonium sulfate precipitation and subsequent steps, the supernatant (S100) was used for 5-LO activity assay.
Residue:
674
  
Inhibitor
Name:
BDBM50444319
Synonyms:
CHEMBL3094153
Type:
Small organic molecule
Emp. Form.:
C24H31O5
Mol. Mass.:
399.5005
SMILES:
CC(C)CCCC(C)CCOc1ccc(COc2cccc(O)c2C([O-])=O)cc1
: