Target
Kallikrein-7
Ligand
BDBM50444600
Substrate
Meas. Tech.
ChEMBL_1282441 (CHEMBL3100742)
Ki
166000±n/a nM
Citation
 Tan, XBertonati, CQin, LFurio, LEl Amri, CHovnanian, AReboud-Ravaux, MVilloutreix, BO Identification by in silico and in vitro screenings of small organic molecules acting as reversible inhibitors of kallikreins. Eur J Med Chem 70:661-8 (2013)  
Target
Name:
Kallikrein-7
Synonyms:
KLK7 Kallikrein 7 PRSS6 Serine protease 6 hK7 kallikrein-7 isoform 1 preproprotein
Type:
PROTEIN
Mol. Mass.:
27535.05
Organism:
Homo sapiens (Human)
Description:
ChEMBL_1469257
Residue:
253
  
Inhibitor
Name:
BDBM50444600
Synonyms:
CHEMBL1462676
Type:
Small organic molecule
Emp. Form.:
C22H18N4O2
Mol. Mass.:
370.4039
SMILES:
CNC(=O)c1ccc(Nc2nnc(-c3ccc(O)cc3)c3ccccc23)cc1
: