Target
Kallikrein-14
Ligand
BDBM50444597
Substrate
Meas. Tech.
ChEMBL_1282452 (CHEMBL3100879)
IC50
112000±n/a nM
Citation
 Tan, XBertonati, CQin, LFurio, LEl Amri, CHovnanian, AReboud-Ravaux, MVilloutreix, BO Identification by in silico and in vitro screenings of small organic molecules acting as reversible inhibitors of kallikreins. Eur J Med Chem 70:661-8 (2013)  
Target
Name:
Kallikrein-14
Synonyms:
KLK-L6 KLK14_HUMAN Kallikrein 14 Kallikrein-like protein 6 | hK14
Type:
PROTEIN
Mol. Mass.:
29136.99
Organism:
Homo sapiens (Human)
Description:
ChEMBL_1282452
Residue:
267
  
Inhibitor
Name:
BDBM50444597
Synonyms:
CHEMBL3099882
Type:
Small organic molecule
Emp. Form.:
C20H19FN2O4S
Mol. Mass.:
402.439
SMILES:
COc1ccc(\C=C2\SC(=O)N(CNc3cc(F)ccc3C)C2=O)cc1OC
: