Target
Low molecular weight phosphotyrosine protein phosphatase
Ligand
BDBM50444703
Substrate
Meas. Tech.
ChEMBL_1281646 (CHEMBL3102583)
IC50
22300±n/a nM
Citation
 Ottanà, RMaccari, RMortier, JCaselli, AAmuso, SCamici, GRotondo, AWolber, GPaoli, P Synthesis, biological activity and structure-activity relationships of new benzoic acid-based protein tyrosine phosphatase inhibitors endowed with insulinomimetic effects in mouse C2C12 skeletal muscle cells. Eur J Med Chem 71:112-27 (2014)  
Target
Name:
Low molecular weight phosphotyrosine protein phosphatase
Synonyms:
3.1.3.2 ACP1 LMW-PTP LMWPTP PPAC_HUMAN low molecular weight phosphotyrosine protein phosphatase isoform c
Type:
Mol. Mass.:
18042.81
Organism:
Homo sapiens (Human)
Description:
P24666
Residue:
158
  
Inhibitor
Name:
BDBM50444703
Synonyms:
CHEMBL3098945
Type:
Small organic molecule
Emp. Form.:
C26H21NO6S
Mol. Mass.:
475.513
SMILES:
COc1ccc(\C=C2/SC(=O)N(Cc3ccc(cc3)C(O)=O)C2=O)cc1OCc1ccccc1
: