Target
Tyrosine-protein phosphatase non-receptor type 1
Ligand
BDBM50444696
Substrate
Meas. Tech.
ChEMBL_1281645 (CHEMBL3102582)
IC50
2600±n/a nM
Citation
 Ottanà, RMaccari, RMortier, JCaselli, AAmuso, SCamici, GRotondo, AWolber, GPaoli, P Synthesis, biological activity and structure-activity relationships of new benzoic acid-based protein tyrosine phosphatase inhibitors endowed with insulinomimetic effects in mouse C2C12 skeletal muscle cells. Eur J Med Chem 71:112-27 (2014)  
Target
Name:
Tyrosine-protein phosphatase non-receptor type 1
Synonyms:
PTN1_HUMAN PTPN1 Protein tyrosine phosphatase-1B (PTP1B) Protein-tyrosine phosphatase 1B (PTP1B) Tyrosine-protein phosphatase non-receptor type 1 (PTP1B)
Type:
Protein phosphatase
Mol. Mass.:
49963.76
Organism:
Homo sapiens (Human)
Description:
Human recombinant GST-fusion PTP1B (1-435).
Residue:
435
  
Inhibitor
Name:
BDBM50444696
Synonyms:
CHEMBL3098942
Type:
Small organic molecule
Emp. Form.:
C26H21NO5S
Mol. Mass.:
459.514
SMILES:
OC(=O)c1ccc(CN2C(=O)S\C(=C/c3ccc(OCCc4ccccc4)cc3)C2=O)cc1
: