Target
Lethal factor
Ligand
BDBM50444717
Substrate
Meas. Tech.
ChEMBL_1281781 (CHEMBL3100684)
IC50
>100000±n/a nM
Citation
 Williams, JDKhan, ARCardinale, SCButler, MMBowlin, TLPeet, NP Small molecule inhibitors of anthrax lethal factor toxin. Bioorg Med Chem 22:419-34 (2013)  
Target
Name:
Lethal factor
Synonyms:
Anthrax Lethal Factor (LF) Antrax lethal toxin lef | lethal factor
Type:
PROTEIN
Mol. Mass.:
93758.56
Organism:
Bacillus anthracis
Description:
ChEMBL_1460338
Residue:
809
  
Inhibitor
Name:
BDBM50444717
Synonyms:
CHEMBL3099001
Type:
Small organic molecule
Emp. Form.:
C20H21N3O2
Mol. Mass.:
335.3996
SMILES:
COc1cccc(CCC(=O)Nc2ccc3nc(C)cc(N)c3c2)c1
: