Target
Lethal factor
Ligand
BDBM50444735
Substrate
Meas. Tech.
ChEMBL_1281772 (CHEMBL3100541)
IC50
1102±n/a nM
Citation
 Williams, JDKhan, ARCardinale, SCButler, MMBowlin, TLPeet, NP Small molecule inhibitors of anthrax lethal factor toxin. Bioorg Med Chem 22:419-34 (2013)  
Target
Name:
Lethal factor
Synonyms:
Anthrax Lethal Factor (LF) Antrax lethal toxin lef | lethal factor
Type:
PROTEIN
Mol. Mass.:
93758.56
Organism:
Bacillus anthracis
Description:
ChEMBL_1460338
Residue:
809
  
Inhibitor
Name:
BDBM50444735
Synonyms:
CHEMBL3099031
Type:
Small organic molecule
Emp. Form.:
C26H20N4O
Mol. Mass.:
404.4632
SMILES:
Cc1cc(N)c2cc(NC(=O)c3ccc(cc3)-c3ccc4ncccc4c3)ccc2n1
: