Target
Lethal factor
Ligand
BDBM50444748
Substrate
Meas. Tech.
ChEMBL_1281781 (CHEMBL3100684)
IC50
3200±n/a nM
Citation
 Williams, JDKhan, ARCardinale, SCButler, MMBowlin, TLPeet, NP Small molecule inhibitors of anthrax lethal factor toxin. Bioorg Med Chem 22:419-34 (2013)  
Target
Name:
Lethal factor
Synonyms:
Anthrax Lethal Factor (LF) Antrax lethal toxin lef | lethal factor
Type:
PROTEIN
Mol. Mass.:
93758.56
Organism:
Bacillus anthracis
Description:
ChEMBL_1460338
Residue:
809
  
Inhibitor
Name:
BDBM50444748
Synonyms:
Aminoquinuride
Type:
Small organic molecule
Emp. Form.:
C21H20N6O
Mol. Mass.:
372.4231
SMILES:
Cc1cc(N)c2cc(NC(=O)Nc3ccc4nc(C)cc(N)c4c3)ccc2n1
: