Target
Delta carbonic anhydrase
Ligand
BDBM29278
Substrate
Meas. Tech.
ChEMBL_1282543 (CHEMBL3101210)
Ki
9200±n/a nM
Citation
 Vullo, DDel Prete, SOsman, SMDe Luca, VScozzafava, AAlothman, ZSupuran, CTCapasso, C Sulfonamide inhibition studies of thed-carbonic anhydrase from the diatom Thalassiosira weissflogii. Bioorg Med Chem Lett 24:275-9 (2013)  
Target
Name:
Delta carbonic anhydrase
Synonyms:
ca1
Type:
PROTEIN
Mol. Mass.:
32261.40
Organism:
Thalassiosira weissflogii
Description:
ChEMBL_107983
Residue:
281
  
Inhibitor
Name:
BDBM29278
Synonyms:
CHEMBL310671 SAC Saccharin
Type:
Small organic molecule
Emp. Form.:
C7H5NO3S
Mol. Mass.:
183.185
SMILES:
O=C1NS(=O)(=O)c2ccccc12
: