Target
Calcitonin gene-related peptide type 1 receptor/Receptor activity-modifying protein 1
Ligand
BDBM50444968
Substrate
Meas. Tech.
ChEMBL_1281519 (CHEMBL3102085)
Ki
0.220000±n/a nM
Citation
 Kim, JJWood, MRStachel, SJde Leon, PNomland, AStump, CAMcWherter, MASchirripa, KMMoore, ELSalvatore, CASelnick, HG (E)-Alkenes as replacements of amide bonds: development of novel and potent acyclic CGRP receptor antagonists. Bioorg Med Chem Lett 24:258-61 (2013)  
Target
Name:
Calcitonin gene-related peptide type 1 receptor/Receptor activity-modifying protein 1
Synonyms:
Calcitonin-gene-related peptide receptor, CALCRL/RAMP1
Type:
Mol. Mass.:
Description:
ASSAY_ID of EBI is 327200
Components:
This complex has 2 components.
Component 1
Name:
Calcitonin gene-related peptide type 1 receptor
Synonyms:
Adrenomedullin receptor AM1; CALCRL/RAMP2 CALRL_HUMAN CGRP type 1 receptor mRNA Calcitonin gene-related peptide (CGRP) receptor Calcitonin receptor-like receptor Human CL receptor
Type:
Enzyme Catalytic Domain
Mol. Mass.:
52980.45
Organism:
Homo sapiens (Human)
Description:
Q16602
Residue:
461
  
Component 2
Name:
Receptor activity-modifying protein 1
Synonyms:
Calcitonin-gene-related peptide receptor, CALCRL/RAMP1 RAMP1_HUMAN
Type:
PROTEIN
Mol. Mass.:
16992.80
Organism:
Homo sapiens (Human)
Description:
EBI_100673
Residue:
148
  
Inhibitor
Name:
BDBM50444968
Synonyms:
CHEMBL3099935
Type:
Small organic molecule
Emp. Form.:
C30H32F2N4O2
Mol. Mass.:
518.5975
SMILES:
C[C@@H](N(CCCc1cnc2C[C@]3(Cc2c1)C(=O)Nc1ncccc31)C(=O)C(C)(C)C)c1cc(F)cc(F)c1
: