Target
Serine/threonine-protein kinase pim-1
Ligand
BDBM50445133
Substrate
Meas. Tech.
ChEMBL_1284449 (CHEMBL3106177)
Ki
0.002000±n/a nM
Citation
 Burger, MTHan, WLan, JNishiguchi, GBellamacina, CLindval, MAtallah, GDing, YMathur, MMcBride, CBeans, ELMuller, KTamez, VZhang, YHuh, KFeucht, PZavorotinskaya, TDai, YHolash, JCastillo, JLangowski, JWang, YChen, MYGarcia, PD Structure Guided Optimization, in Vitro Activity, and in Vivo Activity of Pan-PIM Kinase Inhibitors. ACS Med Chem Lett 4:1193-7 (2013)  
Target
Name:
Serine/threonine-protein kinase pim-1
Synonyms:
PIM-1 Kinase PIM1_HUMAN Serine/threonine-protein kinase (PIM1) Serine/threonine-protein kinase PIM1 | Serine/threonine-protein kinase pim-1 (PIM1)
Type:
Protein
Mol. Mass.:
35681.82
Organism:
Homo sapiens (Human)
Description:
P11309
Residue:
313
  
Inhibitor
Name:
BDBM50445133
Synonyms:
CHEMBL3103869
Type:
Small organic molecule
Emp. Form.:
C22H22F2N6O2
Mol. Mass.:
440.4459
SMILES:
N[C@@H]1CN(CC[C@H]1O)c1ccncc1NC(=O)c1nc(ccc1N)-c1c(F)cccc1F
: