Target
Sigma non-opioid intracellular receptor 1
Ligand
BDBM50170654
Substrate
Meas. Tech.
ChEMBL_1284611 (CHEMBL3106939)
Ki
0.005000±n/a nM
Citation
 Brune, SPricl, SWünsch, B Structure of thes1 receptor and its ligand binding site. J Med Chem 56:9809-19 (2013)  
Target
Name:
Sigma non-opioid intracellular receptor 1
Synonyms:
OPRS1 SIGMAR1 Sigma non-opioid intracellular receptor 1 Sigma1-receptor Sterol isomerase-like protein
Type:
Protein
Mol. Mass.:
25307.17
Organism:
Cavia porcellus (Guinea pig)
Description:
Q60492
Residue:
223
  
Inhibitor
Name:
BDBM50170654
Synonyms:
(+-)-cis-4-(3-(4-tert-butylphenyl)-2-methylpropyl)-2,6-dimethylmorpholine CHEMBL372700 cis-4-(3-(4-(1,1-dimethylethyl)phenyl)-2-methylpropyl)-2,6-dimethylmorpholine cis-fenpropimorph fenpropimorph cis-form | fenpropimorphe
Type:
Small organic molecule
Emp. Form.:
C20H33NO
Mol. Mass.:
303.4821
SMILES:
CC(CN1C[C@H](C)O[C@H](C)C1)Cc1ccc(cc1)C(C)(C)C
: