Target
Dual specificity tyrosine-phosphorylation-regulated kinase 1A
Ligand
BDBM50445228
Substrate
Meas. Tech.
ChEMBL_1284985 (CHEMBL3108566)
Ki
12±n/a nM
Citation
 Gourdain, SDairou, JDenhez, CBui, LCRodrigues-Lima, FJanel, NDelabar, JMCariou, KDodd, RH Development of DANDYs, new 3,5-diaryl-7-azaindoles demonstrating potent DYRK1A kinase inhibitory activity. J Med Chem 56:9569-85 (2014)  
Target
Name:
Dual specificity tyrosine-phosphorylation-regulated kinase 1A
Synonyms:
DYR1A_RAT Dual-specificity tyrosine-(Y)-phosphorylation regulated kinase 1A Dyrk1a
Type:
Enzyme Catalytic Domain
Mol. Mass.:
85573.59
Organism:
RAT
Description:
Dual-specificity tyrosine-(Y)-phosphorylation regulated kinase 1A 0 RAT::Q63470
Residue:
763
  
Inhibitor
Name:
BDBM50445228
Synonyms:
CHEMBL3102954
Type:
Small organic molecule
Emp. Form.:
C19H14N2O4
Mol. Mass.:
334.3255
SMILES:
Oc1ccc(O)c(c1)-c1cnc2[nH]cc(-c3ccc(O)c(O)c3)c2c1
: