Target
Neuronal acetylcholine receptor subunit alpha-3/beta-4
Ligand
BDBM50445321
Substrate
Meas. Tech.
ChEMBL_1285319 (CHEMBL3107569)
IC50
750±n/a nM
Citation
 Luo, SZhangsun, DZhu, XWu, YHu, YChristensen, SHarvey, PJAkcan, MCraik, DJMcIntosh, JM Characterization of a novela-conotoxin TxID from Conus textile that potently blocks rata3ß4 nicotinic acetylcholine receptors. J Med Chem 56:9655-63 (2014)  
Target
Name:
Neuronal acetylcholine receptor subunit alpha-3/beta-4
Synonyms:
Neuronal acetylcholine receptor Alpha-3/Beta-4 Neuronal acetylcholine receptor; alpha3/beta4 | nAChR subtypes alpha3 beta4
Type:
Protein
Mol. Mass.:
Description:
Components:
This complex has 2 components.
Component 1
Name:
Neuronal acetylcholine receptor subunit alpha-3
Synonyms:
ACHA3_RAT Chrna3
Type:
Enzyme
Mol. Mass.:
56995.52
Organism:
Rattus norvegicus (Rat)
Description:
P04757
Residue:
499
  
Component 2
Name:
Neuronal acetylcholine receptor subunit beta-4
Synonyms:
ACHB4_RAT Chrnb4 Neuronal acetylcholine receptor non-alpha-2 chain | Neuronal acetylcholine receptor protein beta-4 subunit
Type:
Enzyme
Mol. Mass.:
55863.89
Organism:
Rattus norvegicus (Rat)
Description:
P12392
Residue:
495
  
Inhibitor
Name:
BDBM50445321
Synonyms:
CHEMBL3104244
Type:
Small organic molecule
Emp. Form.:
C65H89N17O21S4
Mol. Mass.:
1572.763
SMILES:
C[C@@H](O)[C@@H]1NC(=O)[C@H](C)NC(=O)[C@H](Cc2ccccc2)NC(=O)[C@@H]2CSSC[C@@H](NC(=O)CN)C(=O)N[C@@H](CSSC[C@H](NC(=O)[C@H](CC(O)=O)NC(=O)[C@@H]3CCCN3C(=O)[C@H](CC(N)=O)NC1=O)C(N)=O)C(=O)N[C@@H](CO)C(=O)N[C@@H](Cc1ccc(O)cc1)C(=O)N1CCC[C@H]1C(=O)N1CCC[C@H]1C(=O)N2
: