Target
Neuronal acetylcholine receptor subunit alpha-3/alpha-6/beta-2/beta-3
Ligand
BDBM50445325
Substrate
Meas. Tech.
ChEMBL_1285330 (CHEMBL3107580)
IC50
0.950000±n/a nM
Citation
 Luo, SZhangsun, DZhu, XWu, YHu, YChristensen, SHarvey, PJAkcan, MCraik, DJMcIntosh, JM Characterization of a novela-conotoxin TxID from Conus textile that potently blocks rata3ß4 nicotinic acetylcholine receptors. J Med Chem 56:9655-63 (2014)  
Target
Name:
Neuronal acetylcholine receptor subunit alpha-3/alpha-6/beta-2/beta-3
Synonyms:
Neuronal acetylcholine receptor protein beta-2 subunit/protein beta-3 subunit/subunit alpha-3/subunit alpha-6 | Neuronal acetylcholine receptor; alpha3/alpha6/beta2/beta3
Type:
Mol. Mass.:
Description:
ASSAY_ID of EBI is 306494
Components:
This complex has 4 components.
Component 1
Name:
Neuronal acetylcholine receptor subunit beta-3
Synonyms:
ACHB3_HUMAN Neuronal acetylcholine receptor protein beta-3 subunit | Neuronal acetylcholine receptor subunit beta-3
Type:
PROTEIN
Mol. Mass.:
52736.06
Organism:
Homo sapiens (Human)
Description:
EBI_10025
Residue:
458
  
Component 2
Name:
Neuronal acetylcholine receptor subunit beta-2
Synonyms:
ACHB2_HUMAN Neuronal acetylcholine receptor protein beta-2 subunit | Nicotinic acetylcholine receptor alpha3/beta2/alpha5
Type:
Protein
Mol. Mass.:
57020.50
Organism:
Homo sapiens (Human)
Description:
P17787
Residue:
502
  
Component 3
Name:
Neuronal acetylcholine receptor subunit alpha-3
Synonyms:
ACHA3_HUMAN Cholinergic, Nicotinic Alpha3Beta2 Cholinergic, Nicotinic Alpha3Beta4x NACHRA3 Neuronal acetylcholine receptor subunit alpha-3 nicotinic central
Type:
Enzyme Catalytic Domain
Mol. Mass.:
57479.03
Organism:
Homo sapiens (Human)
Description:
Cholinergic, Nicotinic Alpha3Beta2 0 HUMAN::P32297
Residue:
505
  
Component 4
Name:
Neuronal acetylcholine receptor subunit alpha-6
Synonyms:
ACHA6_HUMAN Neuronal acetylcholine receptor protein alpha-6 subunit
Type:
PROTEIN
Mol. Mass.:
56898.54
Organism:
Homo sapiens (Human)
Description:
EBI_12774
Residue:
494
  
Inhibitor
Name:
BDBM50445325
Synonyms:
CHEMBL3104238
Type:
Small organic molecule
Emp. Form.:
C79H125N27O25S4
Mol. Mass.:
1981.264
SMILES:
CC[C@H](C)[C@@H]1NC(=O)[C@H](CCC(N)=O)NC(=O)[C@@H]2CCCN2C(=O)[C@H](CC(N)=O)NC(=O)[C@H](Cc2cnc[nH]2)NC(=O)[C@@H](NC(=O)[C@@H](NC(=O)[C@@H]2CSSC[C@H](NC(=O)[C@@H]3CCCN3C(=O)[C@H](CC(O)=O)NC(=O)[C@@H](N)CCCN=C(N)N)C(=O)N[C@@H](CSSC[C@H](NC1=O)C(N)=O)C(=O)N[C@@H](CO)C(=O)N[C@@H](CC(N)=O)C(=O)N1CCC[C@H]1C(=O)N[C@@H](C(C)C)C(=O)N2)[C@@H](C)O)C(C)C
: