Target
Glutathione reductase, mitochondrial
Ligand
BDBM50015950
Substrate
Meas. Tech.
ChEMBL_1284129 (CHEMBL3107513)
IC50
8100±n/a nM
Citation
 Braga, SFAlves, ÉVFerreira, RSFradico, JRLage, PSDuarte, MCRibeiro, TGJúnior, PARomanha, AJTonini, MLSteindel, MCoelho, EFde Oliveira, RB Synthesis and evaluation of the antiparasitic activity of bis-(arylmethylidene) cycloalkanones. Eur J Med Chem 71:282-9 (2014)  
Target
Name:
Glutathione reductase, mitochondrial
Synonyms:
GLUR GSHR_HUMAN Glutathione reductase | Glutathione reductase (GR)
Type:
Enzyme
Mol. Mass.:
56271.52
Organism:
Homo sapiens (Human)
Description:
P00390
Residue:
522
  
Inhibitor
Name:
BDBM50015950
Synonyms:
1,3-bis(2-chloroethyl)-1-nitrosourea CARMUSTINE Gliadel | N,N'-Bis(2-chloroethyl)-N-nitrosourea
Type:
Small organic molecule
Emp. Form.:
C5H9Cl2N3O2
Mol. Mass.:
214.05
SMILES:
ClCCNC(=O)N(CCCl)N=O
: