Target
Insulin-like growth factor 1 receptor
Ligand
BDBM50445471
Substrate
Meas. Tech.
ChEMBL_1284302 (CHEMBL3108323)
IC50
3500±n/a nM
Citation
 El Amrani, MLai, DDebbab, AAly, AHSiems, KSeidel, CSchnekenburger, MGaigneaux, ADiederich, MFeger, DLin, WProksch, P Protein kinase and HDAC inhibitors from the endophytic fungus Epicoccum nigrum. J Nat Prod 77:49-56 (2014)  
Target
Name:
Insulin-like growth factor 1 receptor
Synonyms:
CD_antigen=CD221 IGF1R Insulin-like growth factor 1 receptor (IGF1R) Insulin-like growth factor 1 receptor alpha chain Insulin-like growth factor I receptor | Insulin-like growth factor receptor (IGFR)
Type:
Protein
Mol. Mass.:
154776.79
Organism:
Homo sapiens (Human)
Description:
P08069
Residue:
1367
  
Inhibitor
Name:
BDBM50445471
Synonyms:
CHEMBL3104853
Type:
Small organic molecule
Emp. Form.:
C10H12O5
Mol. Mass.:
212.1993
SMILES:
COCc1c(C)c(O)c(O)c(O)c1C=O
: