Target
Hepatocyte growth factor receptor
Ligand
BDBM50445474
Substrate
Meas. Tech.
ChEMBL_1284300 (CHEMBL3108321)
IC50
1120±n/a nM
Citation
 El Amrani, MLai, DDebbab, AAly, AHSiems, KSeidel, CSchnekenburger, MGaigneaux, ADiederich, MFeger, DLin, WProksch, P Protein kinase and HDAC inhibitors from the endophytic fungus Epicoccum nigrum. J Nat Prod 77:49-56 (2014)  
Target
Name:
Hepatocyte growth factor receptor
Synonyms:
Hepatocyte growth factor receptor Hepatocyte growth factor receptor (c-MET) MET Met proto-oncogene (hepatocyte growth factor receptor) Tyrosine-protein kinase Met (c-Met) c-Met kinase
Type:
Protein
Mol. Mass.:
155559.73
Organism:
Homo sapiens (Human)
Description:
P08581
Residue:
1390
  
Inhibitor
Name:
BDBM50445474
Synonyms:
CHEMBL3104855
Type:
Small organic molecule
Emp. Form.:
C18H14O8
Mol. Mass.:
358.299
SMILES:
Cc1c(O)c(O)c2oc(cc2c1C=O)-c1c(C)c(O)c(O)c(O)c1C=O
: