Target
1-deoxy-D-xylulose 5-phosphate reductoisomerase
Ligand
BDBM50153713
Substrate
Meas. Tech.
ChEMBL_1285688 (CHEMBL3106798)
IC50
440±n/a nM
Citation
 Jackson, ERSan Jose, GBrothers, RCEdelstein, EKSheldon, ZHaymond, AJohny, CBoshoff, HICouch, RDDowd, CS The effect of chain length and unsaturation on Mtb Dxr inhibition and antitubercular killing activity of FR900098 analogs. Bioorg Med Chem Lett 24:649-53 (2014)  
Target
Name:
1-deoxy-D-xylulose 5-phosphate reductoisomerase
Synonyms:
DXR_MYCTU | dxr
Type:
PROTEIN
Mol. Mass.:
42846.92
Organism:
Mycobacterium tuberculosis
Description:
ChEMBL_1474510
Residue:
413
  
Inhibitor
Name:
BDBM50153713
Synonyms:
3-(N-hydroxyformamido)propylphosphonic acid CHEMBL203125 fosmidomycin
Type:
Small organic molecule
Emp. Form.:
C4H10NO5P
Mol. Mass.:
183.0997
SMILES:
ON(CCCP(O)(O)=O)C=O
: