Target
Substance-P receptor
Ligand
BDBM50445808
Substrate
Meas. Tech.
ChEMBL_1284926 (CHEMBL3108367)
Ki
13±n/a nM
Citation
 Hanessian, SBabonneau, VBoyer, NMannoury la Cour, CMillan, MJDe Nanteuil, G Design and synthesis of potential dual NK(1)/NK(3) receptor antagonists. Bioorg Med Chem Lett 24:510-4 (2014)  
Target
Name:
Substance-P receptor
Synonyms:
NK-1 receptor NK1 Receptor NK1R_HUMAN Neurokinin-1 (NK-1) SPR TACR1 Tachykinin receptor 1 (NK1) | tachykinin
Type:
G Protein-Coupled Receptor (GPCR)
Mol. Mass.:
46254.43
Organism:
Homo sapiens (Human)
Description:
P25103
Residue:
407
  
Inhibitor
Name:
BDBM50445808
Synonyms:
CHEMBL3104784
Type:
Small organic molecule
Emp. Form.:
C30H28F9N3O2
Mol. Mass.:
633.5478
SMILES:
CN(C(=O)C(C)(C)c1cc(cc(c1)C(F)(F)F)C(F)(F)F)c1cnc(cc1-c1ccc(F)cc1C)N1CC(F)(F)C[C@H]1CO
: