Target
Neuromedin-K receptor
Ligand
BDBM50445816
Substrate
Meas. Tech.
ChEMBL_1284927 (CHEMBL3108368)
Ki
>10000±n/a nM
Citation
 Hanessian, SBabonneau, VBoyer, NMannoury la Cour, CMillan, MJDe Nanteuil, G Design and synthesis of potential dual NK(1)/NK(3) receptor antagonists. Bioorg Med Chem Lett 24:510-4 (2014)  
Target
Name:
Neuromedin-K receptor
Synonyms:
NK-3 receptor NK3R NKR Neurokinin B receptor Neuromedin-3 receptor (NK-3R) Neuromedin-K receptor Neuromedin-K receptor (NK3) TAC3R Tachykinin receptor 3 | Tachykinin receptor 3 (NK3)
Type:
Enzyme
Mol. Mass.:
52221.96
Organism:
Homo sapiens (Human)
Description:
P29371
Residue:
465
  
Inhibitor
Name:
BDBM50445816
Synonyms:
CHEMBL3104781
Type:
Small organic molecule
Emp. Form.:
C26H29F6N3O3
Mol. Mass.:
545.5172
SMILES:
CC(C)(C(=O)N[C@@H](C(=O)NCCN1CCOCC1)c1ccccc1)c1cc(cc(c1)C(F)(F)F)C(F)(F)F
: