Target
Neuromedin-K receptor
Ligand
BDBM50445804
Substrate
Meas. Tech.
ChEMBL_1284927 (CHEMBL3108368)
Ki
10000±n/a nM
Citation
 Hanessian, SBabonneau, VBoyer, NMannoury la Cour, CMillan, MJDe Nanteuil, G Design and synthesis of potential dual NK(1)/NK(3) receptor antagonists. Bioorg Med Chem Lett 24:510-4 (2014)  
Target
Name:
Neuromedin-K receptor
Synonyms:
NK-3 receptor NK3R NKR Neurokinin B receptor Neuromedin-3 receptor (NK-3R) Neuromedin-K receptor Neuromedin-K receptor (NK3) TAC3R Tachykinin receptor 3 | Tachykinin receptor 3 (NK3)
Type:
Enzyme
Mol. Mass.:
52221.96
Organism:
Homo sapiens (Human)
Description:
P29371
Residue:
465
  
Inhibitor
Name:
BDBM50445804
Synonyms:
CHEMBL3104780
Type:
Small organic molecule
Emp. Form.:
C27H32F6N4O2
Mol. Mass.:
558.559
SMILES:
CN1CCN(CCNC(=O)[C@@H](NC(=O)C(C)(C)c2cc(cc(c2)C(F)(F)F)C(F)(F)F)c2ccccc2)CC1
: