Target
Poly [ADP-ribose] polymerase 1
Ligand
BDBM50316226
Substrate
Meas. Tech.
ChEMBL_1283536 (CHEMBL3107467)
IC50
32±n/a nM
Citation
 Cincinelli, RMusso, LMerlini, LGiannini, GVesci, LMilazzo, FMCarenini, NPerego, PPenco, SArtali, RZunino, FPisano, CDallavalle, S 7-Azaindole-1-carboxamides as a new class of PARP-1 inhibitors. Bioorg Med Chem 22:1089-103 (2014)  
Target
Name:
Poly [ADP-ribose] polymerase 1
Synonyms:
(ARTD1 or PARP1) 2.4.2.30 ADPRT ARTD1 Human diphtheria toxin-like ADP-ribosyltransferase (ARTD1 or PARP1) NT-PARP-1 PARP1 PPOL Poly [ADP-ribose] polymerase 1 (PARP) Poly [ADP-ribose] polymerase 1 (PARP1) Poly [ADP-ribose] polymerase 1, 28-kDa form Poly [ADP-ribose] polymerase 1, processed C-terminus Poly [ADP-ribose] polymerase-1 Poly(ADP-ribose) polymerase-1 (ARTD1/PARP1) Protein poly-ADP-ribosyltransferase PARP1 | Synonyms=ADPRT
Type:
Mol. Mass.:
113114.22
Organism:
Homo sapiens (Human)
Description:
P09874
Residue:
1014
  
Inhibitor
Name:
BDBM50316226
Synonyms:
(S)-2-(4-(piperidin-3-yl)phenyl)-2H-indazole-7-carboxamide MK-4827 | Niraparib
Type:
Small organic molecule
Emp. Form.:
C19H20N4O
Mol. Mass.:
320.3883
SMILES:
NC(=O)c1cccc2cn(nc12)-c1ccc(cc1)[C@@H]1CCCNC1
: