Target
Kallikrein-5 [D153N]
Ligand
BDBM50446224
Substrate
Meas. Tech.
ChEMBL_1288000 (CHEMBL3110699)
IC50
15500±n/a nM
Citation
 Oliveira, JPFreitas, RFMelo, LSBarros, TGSantos, JAJuliano, MAPinheiro, SBlaber, MJuliano, LMuri, EMPuzer, L Isomannide-based peptidomimetics as inhibitors for human tissue kallikreins 5 and 7. ACS Med Chem Lett 5:128-32 (2014)  
Target
Name:
Kallikrein-5 [D153N]
Synonyms:
KLK-L2 KLK5_HUMAN Kallikrein-5 SCTE | Stratum corneum tryptic enzyme
Type:
PROTEIN
Mol. Mass.:
32031.75
Organism:
Homo sapiens (Human)
Description:
ChEMBL_1282456
Residue:
293
  
Inhibitor
Name:
BDBM50446224
Synonyms:
CHEMBL3109160
Type:
Small organic molecule
Emp. Form.:
C28H35NO8
Mol. Mass.:
513.5794
SMILES:
CC(C)(C)OC(=O)N[C@H](COCc1ccccc1)C(=O)O[C@@H]1CO[C@@H]2[C@@H](CO[C@H]12)OCc1ccccc1
: