Target
Kallikrein-5 [D153N]
Ligand
BDBM50446228
Substrate
Meas. Tech.
ChEMBL_1287999 (CHEMBL3110698)
Ki
1700±n/a nM
Citation
 Oliveira, JPFreitas, RFMelo, LSBarros, TGSantos, JAJuliano, MAPinheiro, SBlaber, MJuliano, LMuri, EMPuzer, L Isomannide-based peptidomimetics as inhibitors for human tissue kallikreins 5 and 7. ACS Med Chem Lett 5:128-32 (2014)  
Target
Name:
Kallikrein-5 [D153N]
Synonyms:
KLK-L2 KLK5_HUMAN Kallikrein-5 SCTE | Stratum corneum tryptic enzyme
Type:
PROTEIN
Mol. Mass.:
32031.75
Organism:
Homo sapiens (Human)
Description:
ChEMBL_1282456
Residue:
293
  
Inhibitor
Name:
BDBM50446228
Synonyms:
CHEMBL3109061
Type:
Small organic molecule
Emp. Form.:
C40H49N5O10
Mol. Mass.:
759.8446
SMILES:
[#6]C([#6])([#6])[#8]-[#6](=O)-[#7]-[#6@H](-[#6]-[#6]-[#6]\[#7]=[#6](/[#7]-[#6](=O)-[#8]-[#6]-c1ccccc1)-[#7]-[#6](=O)-[#8]-[#6]-c1ccccc1)-[#6](=O)-[#7]-[#6@H]-1-[#6]-[#8]-[#6@@H]-2-[#6@@H](-[#6]-[#8]-[#6@H]-1-2)-[#8]-[#6]-c1ccccc1
: