Target
Kallikrein-5 [D153N]
Ligand
BDBM50446219
Substrate
Meas. Tech.
ChEMBL_1287999 (CHEMBL3110698)
Ki
700±n/a nM
Citation
 Oliveira, JPFreitas, RFMelo, LSBarros, TGSantos, JAJuliano, MAPinheiro, SBlaber, MJuliano, LMuri, EMPuzer, L Isomannide-based peptidomimetics as inhibitors for human tissue kallikreins 5 and 7. ACS Med Chem Lett 5:128-32 (2014)  
Target
Name:
Kallikrein-5 [D153N]
Synonyms:
KLK-L2 KLK5_HUMAN Kallikrein-5 SCTE | Stratum corneum tryptic enzyme
Type:
PROTEIN
Mol. Mass.:
32031.75
Organism:
Homo sapiens (Human)
Description:
ChEMBL_1282456
Residue:
293
  
Inhibitor
Name:
BDBM50446219
Synonyms:
CHEMBL3109165
Type:
Small organic molecule
Emp. Form.:
C32H42N2O9
Mol. Mass.:
598.6839
SMILES:
CC(C)(C)OC(=O)N[C@@H](CCCCNC(=O)OCc1ccccc1)C(=O)O[C@@H]1CO[C@@H]2[C@@H](CO[C@H]12)OCc1ccccc1
: