Target
Kallikrein-7
Ligand
BDBM50446211
Substrate
Meas. Tech.
ChEMBL_1287997 (CHEMBL3110696)
IC50
23600±n/a nM
Citation
 Oliveira, JPFreitas, RFMelo, LSBarros, TGSantos, JAJuliano, MAPinheiro, SBlaber, MJuliano, LMuri, EMPuzer, L Isomannide-based peptidomimetics as inhibitors for human tissue kallikreins 5 and 7. ACS Med Chem Lett 5:128-32 (2014)  
Target
Name:
Kallikrein-7
Synonyms:
KLK7 Kallikrein 7 PRSS6 Serine protease 6 hK7 kallikrein-7 isoform 1 preproprotein
Type:
PROTEIN
Mol. Mass.:
27535.05
Organism:
Homo sapiens (Human)
Description:
ChEMBL_1469257
Residue:
253
  
Inhibitor
Name:
BDBM50446211
Synonyms:
CHEMBL3109058
Type:
Small organic molecule
Emp. Form.:
C32H43N3O8
Mol. Mass.:
597.6991
SMILES:
CC(C)(C)OC(=O)N[C@@H](CCCCNC(=O)OCc1ccccc1)C(=O)N[C@H]1CO[C@@H]2[C@@H](CO[C@H]12)OCc1ccccc1
: