Target
Proteinase-activated receptor 1
Ligand
BDBM50261110
Substrate
Meas. Tech.
ChEMBL_1286966 (CHEMBL3111131)
Ki
8.5±n/a nM
Citation
 Chelliah, MVChackalamannil, SXia, YGreenlee, WJAhn, HSKurowski, SBoykow, GHsieh, YChintala, M Himbacine-derived thrombin receptor antagonists: c7-aminomethyl and c9a-hydroxy analogues of vorapaxar. ACS Med Chem Lett 5:183-7 (2014)  
Target
Name:
Proteinase-activated receptor 1
Synonyms:
CF2R F2R PAR1 Proteinase activated receptor 1 TR Thrombin receptor/ Proteinase-activated receptor 1(Par-1)
Type:
Protein
Mol. Mass.:
47450.07
Organism:
Homo sapiens (Human)
Description:
P25116
Residue:
425
  
Inhibitor
Name:
BDBM50261110
Synonyms:
CHEMBL493982 VORAPAXAR
Type:
Small organic molecule
Emp. Form.:
C29H33FN2O4
Mol. Mass.:
492.5817
SMILES:
CCOC(=O)N[C@@H]1CC[C@@H]2[C@H](C[C@@H]3[C@@H]([C@@H](C)OC3=O)[C@H]2C=Cc2ccc(cn2)-c2cccc(F)c2)C1
: