Target
Clathrin heavy chain 1
Ligand
BDBM50446551
Substrate
Meas. Tech.
ChEMBL_1286508 (CHEMBL3110376)
IC50
18000±n/a nM
Citation
 MacGregor, KARobertson, MJYoung, KAvon Kleist, LStahlschmidt, WWhiting, AChau, NRobinson, PJHaucke, VMcCluskey, A Development of 1,8-naphthalimides as clathrin inhibitors. J Med Chem 57:131-43 (2014)  
Target
Name:
Clathrin heavy chain 1
Synonyms:
CLH-17 CLH1_HUMAN CLTCL2 KIAA0034
Type:
PROTEIN
Mol. Mass.:
191588.72
Organism:
Homo sapiens (Human)
Description:
ChEMBL_107994
Residue:
1675
  
Inhibitor
Name:
BDBM50446551
Synonyms:
CHEMBL3110174
Type:
Small organic molecule
Emp. Form.:
C19H13N2O5S
Mol. Mass.:
381.382
SMILES:
Nc1ccc(CN2C(=O)c3cccc4cc(cc(C2=O)c34)S([O-])(=O)=O)cc1
: