Target
Tyrosine-protein kinase receptor UFO
Ligand
BDBM50446566
Substrate
Meas. Tech.
ChEMBL_1286364 (CHEMBL3111645)
IC50
>100000±n/a nM
Citation
 Daletos, Gde Voogd, NJMüller, WEWray, VLin, WFeger, DKubbutat, MAly, AHProksch, P Cytotoxic and protein kinase inhibiting nakijiquinones and nakijiquinols from the sponge Dactylospongia metachromia. J Nat Prod 77:218-26 (2014)  
Target
Name:
Tyrosine-protein kinase receptor UFO
Synonyms:
AXL TEL/AXL UFO | UFO_HUMAN
Type:
Enzyme
Mol. Mass.:
98316.97
Organism:
Homo sapiens (Human)
Description:
P30530
Residue:
894
  
Inhibitor
Name:
BDBM50446566
Synonyms:
CHEMBL3109401
Type:
Small organic molecule
Emp. Form.:
C26H39NO3
Mol. Mass.:
413.5928
SMILES:
CC(C)CC=Nc1cc(O)c(O)c(C[C@]2(C)[C@@H](C)CC[C@]3(C)[C@H]2CCC=C3C)c1O
: