Target
Amiloride-sensitive amine oxidase [copper-containing]
Ligand
BDBM50446745
Substrate
Meas. Tech.
ChEMBL_1288377 (CHEMBL3118035)
IC50
>1000000±n/a nM
Citation
 Lucchesini, FPocci, MAlfei, SBertini, VBuffoni, F Synthesis of 2,6-disubstituted benzylamine derivatives as reversible selective inhibitors of copper amine oxidases. Bioorg Med Chem 22:1558-67 (2014)  
Target
Name:
Amiloride-sensitive amine oxidase [copper-containing]
Synonyms:
ABP1 AOC1_PIG Amine oxidase copper domain-containing protein 1 Histaminase | PK-DAO
Type:
PROTEIN
Mol. Mass.:
85480.30
Organism:
Sus scrofa
Description:
ChEMBL_107996
Residue:
755
  
Inhibitor
Name:
BDBM50446745
Synonyms:
CHEMBL3114409
Type:
Small organic molecule
Emp. Form.:
C15H25NO2
Mol. Mass.:
251.3645
SMILES:
CCCCOc1cccc(OCCCC)c1CN
: