Target
Bifunctional epoxide hydrolase 2
Ligand
BDBM50446781
Substrate
Meas. Tech.
ChEMBL_1288411 (CHEMBL3118263)
IC50
18±n/a nM
Citation
 Takai, KNakajima, TTakanashi, YSone, TNariai, TChiyo, NNakatani, SIshikawa, CYamaguchi, NFujita, KYamada, K Structure-based optimization of cyclopropyl urea derivatives as potent soluble epoxide hydrolase inhibitors for potential decrease of renal injury without hypotensive action. Bioorg Med Chem 22:1548-57 (2014)  
Target
Name:
Bifunctional epoxide hydrolase 2
Synonyms:
Ephx2 HYES_RAT
Type:
PROTEIN
Mol. Mass.:
62337.15
Organism:
Rattus norvegicus
Description:
ChEMBL_1465995
Residue:
554
  
Inhibitor
Name:
BDBM50446781
Synonyms:
CHEMBL3114611
Type:
Small organic molecule
Emp. Form.:
C21H24N2O2
Mol. Mass.:
336.4275
SMILES:
O=C(N[C@H]1C[C@@H]1c1ccccc1)N1CCC(CC1)Oc1ccccc1
: