Target
Proprotein convertase subtilisin/kexin type 6
Ligand
BDBM50446942
Substrate
Meas. Tech.
ChEMBL_1290742 (CHEMBL3117754)
Ki
500±n/a nM
Citation
 Kwiatkowska, ACouture, FLevesque, CLy, KDesjardins, RBeauchemin, SPrahl, ALammek, BNeugebauer, WDory, YLDay, R Design, synthesis, and structure-activity relationship studies of a potent PACE4 inhibitor. J Med Chem 57:98-109 (2014)  
Target
Name:
Proprotein convertase subtilisin/kexin type 6
Synonyms:
PACE4 PCSK6_HUMAN | Subtilisin/kexin type 6
Type:
PROTEIN
Mol. Mass.:
106442.22
Organism:
Homo sapiens (Human)
Description:
ChEMBL_1290742
Residue:
969
  
Inhibitor
Name:
BDBM50446942
Synonyms:
CHEMBL3115591
Type:
Small organic molecule
Emp. Form.:
C49H94N16O9
Mol. Mass.:
1051.3725
SMILES:
[#6]-[#6]-[#6]-[#6]-[#6@H](-[#7]-[#6](-[#6])=O)-[#6](=O)-[#7]-[#6@@H](-[#6]-[#6]-[#6]-[#6])-[#6](=O)-[#7]-[#6@@H](-[#6]-[#6]-[#6]-[#6])-[#6](=O)-[#7]-[#6@@H](-[#6]-[#6]-[#6]-[#6])-[#6](=O)-[#7]-[#6@@H](-[#6]-[#6]-[#6]\[#7]=[#6](/[#7])-[#7])-[#6](=O)-[#7]-[#6@@H](-[#6](-[#6])-[#6])-[#6](=O)-[#7]-[#6@@H](-[#6]-[#6]-[#6]-[#6]-[#7])-[#6](=O)-[#7]-[#6@@H](-[#6]-[#6]-[#6]\[#7]=[#6](/[#7])-[#7])-[#6](-[#7])=O
: