Target
Proprotein convertase subtilisin/kexin type 6
Ligand
BDBM50446945
Substrate
Meas. Tech.
ChEMBL_1290742 (CHEMBL3117754)
Ki
5.3±n/a nM
Citation
 Kwiatkowska, ACouture, FLevesque, CLy, KDesjardins, RBeauchemin, SPrahl, ALammek, BNeugebauer, WDory, YLDay, R Design, synthesis, and structure-activity relationship studies of a potent PACE4 inhibitor. J Med Chem 57:98-109 (2014)  
Target
Name:
Proprotein convertase subtilisin/kexin type 6
Synonyms:
PACE4 PCSK6_HUMAN | Subtilisin/kexin type 6
Type:
PROTEIN
Mol. Mass.:
106442.22
Organism:
Homo sapiens (Human)
Description:
ChEMBL_1290742
Residue:
969
  
Inhibitor
Name:
BDBM50446945
Synonyms:
CHEMBL3115770
Type:
Small organic molecule
Emp. Form.:
C48H91N15O8
Mol. Mass.:
1006.3318
SMILES:
[#6]-[#6](-[#6])-[#6]-[#6@H](-[#7]-[#6](-[#6])=O)-[#6](=O)-[#7]-[#6@@H](-[#6]-[#6](-[#6])-[#6])-[#6](=O)-[#7]-[#6@@H](-[#6]-[#6](-[#6])-[#6])-[#6](=O)-[#7]-[#6@@H](-[#6]-[#6](-[#6])-[#6])-[#6](=O)-[#7]-[#6@@H](-[#6]-[#6]-[#6]\[#7]=[#6](/[#7])-[#7])-[#6](=O)-[#7]-[#6@@H](-[#6](-[#6])-[#6])-[#6](=O)-[#7]-[#6@@H](-[#6]-[#6]-[#6]-[#6]-[#7])-[#6](=O)-[#7]-[#6]\[#6]=[#6]\[#6]\[#7]=[#6](/[#7])-[#7]
: