Target
Aldehyde dehydrogenase, dimeric NADP-preferring
Ligand
BDBM50447056
Substrate
Meas. Tech.
ChEMBL_1289619 (CHEMBL3118126)
Ki
200±n/a nM
Citation
 Parajuli, BFishel, MLHurley, TD Selective ALDH3A1 inhibition by benzimidazole analogues increase mafosfamide sensitivity in cancer cells. J Med Chem 57:449-61 (2014)  
Target
Name:
Aldehyde dehydrogenase, dimeric NADP-preferring
Synonyms:
AL3A1_HUMAN ALDH3A1 Aldehyde dehydrogenase family 3 member A1 (ALDH3A1) | Aldehyde dehydrogenase family 3 member A1 (ALDH3A1) (Q122A)
Type:
Protein
Mol. Mass.:
50394.38
Organism:
Homo sapiens (Human)
Description:
Residue:
453
  
Inhibitor
Name:
BDBM50447056
Synonyms:
CHEMBL1378094 US9328112, CB7
Type:
Small organic molecule
Emp. Form.:
C14H11FN2O2S
Mol. Mass.:
290.313
SMILES:
Cc1nc2ccccc2n1S(=O)(=O)c1ccc(F)cc1
: