Target
Hexokinase-4
Ligand
BDBM50447286
Substrate
Meas. Tech.
ChEMBL_1291251 (CHEMBL3117036)
IC50
1420±n/a nM
Citation
 St Jean, DJAshton, KSBartberger, MDChen, JChmait, SCupples, RGalbreath, EHelmering, JHong, FTJordan, SRLiu, LKunz, RKMichelsen, KNishimura, NPennington, LDPoon, SFReid, DSivits, GStec, MMTadesse, STamayo, NVan, GYang, KCZhang, JNorman, MHFotsch, CLloyd, DJHale, C Small molecule disruptors of the glucokinase-glucokinase regulatory protein interaction: 2. Leveraging structure-based drug design to identify analogues with improved pharmacokinetic profiles. J Med Chem 57:325-38 (2014)  
Target
Name:
Hexokinase-4
Synonyms:
GCK Glucokinase (GK) HK IV HXK4_HUMAN Hexokinase-D
Type:
Enzyme
Mol. Mass.:
52175.81
Organism:
Homo sapiens (Human)
Description:
P35557
Residue:
465
  
Inhibitor
Name:
BDBM50447286
Synonyms:
CHEMBL3113992
Type:
Small organic molecule
Emp. Form.:
C17H16F6N2O3S2
Mol. Mass.:
474.441
SMILES:
OC(c1ccc(cc1)N1CCN(CC1)S(=O)(=O)c1cccs1)(C(F)(F)F)C(F)(F)F
: