Target
Coagulation factor X
Ligand
BDBM50447850
Substrate
Meas. Tech.
ChEMBL_1291597 (CHEMBL3118953)
Ki
1800±n/a nM
Citation
 Blizzard, TASingh, SPatil, BChidurala, NKomanduri, VDebnath, SBelyakov, SCrespo, AStruck, AKurtz, MWiltsie, JShen, XSonatore, LArocho, MLewis, DOgletree, MBiftu, T Heterocyclic core analogs of a direct thrombin inhibitor. Bioorg Med Chem Lett 24:1111-5 (2014)  
Target
Name:
Coagulation factor X
Synonyms:
Activated coagulation factor X (FXa) Coagulation factor X precursor F10 Factor X heavy chain Factor Xa Stuart-Prower factor
Type:
Enzyme
Mol. Mass.:
54726.60
Organism:
Homo sapiens (Human)
Description:
Residue:
488
  
Inhibitor
Name:
BDBM50447850
Synonyms:
CHEMBL3114559
Type:
Small organic molecule
Emp. Form.:
C20H30ClN3O3
Mol. Mass.:
395.924
SMILES:
CC(C)(C)[C@@H](O)C(=O)N1CCCC[C@H]1C(=O)NCc1cc(Cl)ccc1CN
: