Target
Alpha-ketoglutarate-dependent dioxygenase alkB homolog 3
Ligand
BDBM50447936
Substrate
Meas. Tech.
ChEMBL_1288598 (CHEMBL3119218)
IC50
3100±n/a nM
Citation
 Nakao, SMabuchi, MShimizu, TItoh, YTakeuchi, YUeda, MMizuno, HShigi, NOhshio, IJinguji, KUeda, YYamamoto, MFurukawa, TAoki, STsujikawa, KTanaka, A Design and synthesis of prostate cancer antigen-1 (PCA-1/ALKBH3) inhibitors as anti-prostate cancer drugs. Bioorg Med Chem Lett 24:1071-4 (2014)  
Target
Name:
Alpha-ketoglutarate-dependent dioxygenase alkB homolog 3
Synonyms:
ABH3 ALKBH3 DEPC-1 Prostate cancer antigen 1
Type:
PROTEIN
Mol. Mass.:
33382.86
Organism:
Homo sapiens (Human)
Description:
ChEMBL_108024
Residue:
286
  
Inhibitor
Name:
BDBM50447936
Synonyms:
CHEMBL3114996
Type:
Small organic molecule
Emp. Form.:
C18H14Cl2N4O
Mol. Mass.:
373.236
SMILES:
Cc1[nH]n(-c2nc3ccccc3[nH]2)c(=O)c1Cc1ccc(Cl)c(Cl)c1
: