Target
Mineralocorticoid receptor
Ligand
BDBM50448165
Substrate
Meas. Tech.
ChEMBL_1292841 (CHEMBL3122505)
Ki
2.5±n/a nM
Citation
 Carson, MWLuz, JGSuen, CMontrose, CZink, RRuan, XCheng, CCole, HAdrian, MDKohlman, DTMabry, TSnyder, NCondon, BMaletic, MClawson, DPustilnik, ACoghlan, MJ Glucocorticoid receptor modulators informed by crystallography lead to a new rationale for receptor selectivity, function, and implications for structure-based design. J Med Chem 57:849-60 (2014)  
Target
Name:
Mineralocorticoid receptor
Synonyms:
MCR MLR NR3C2 | Nuclear receptor subfamily 3 group C member 2
Type:
Enzyme
Mol. Mass.:
107076.42
Organism:
Homo sapiens (Human)
Description:
P08235
Residue:
984
  
Inhibitor
Name:
BDBM50448165
Synonyms:
CHEMBL3120320
Type:
Small organic molecule
Emp. Form.:
C23H21NO2S
Mol. Mass.:
375.483
SMILES:
[#6]S(=O)(=O)[#7]-c1cccc(\[#6]=[#6]-2/c3ccccc3-[#6]-[#6]-c3ccccc-23)c1
: