Target
Cathepsin D
Ligand
BDBM50448549
Substrate
Meas. Tech.
ChEMBL_1295589 (CHEMBL3131975)
IC50
1100±n/a nM
Citation
 Thomas, AAHunt, KWVolgraf, MWatts, RJLiu, XVigers, GSmith, DSammond, DTang, TPRhodes, SPMetcalf, ATBrown, KDOtten, JNBurkard, MCox, AADo, MKDutcher, DRana, SDeLisle, RKRegal, KWright, ADGroneberg, RScearce-Levie, KSiu, MPurkey, HELyssikatos, JPGunawardana, IW Discovery of 7-tetrahydropyran-2-yl chromans:ß-site amyloid precursor protein cleaving enzyme 1 (BACE1) inhibitors that reduce amyloidß-protein (Aß) in the central nervous system. J Med Chem 57:878-902 (2014)  
Target
Name:
Cathepsin D
Synonyms:
CATD_HUMAN CTSD Cathepsin D heavy chain Cathepsin D precursor
Type:
Enzyme
Mol. Mass.:
44551.72
Organism:
Homo sapiens (Human)
Description:
Human proCathepsin D (SwissProt accession number P07339) was expressed in Sf9 cells, purified, and autoactivated.
Residue:
412
  
Inhibitor
Name:
BDBM50448549
Synonyms:
CHEMBL3127106
Type:
Small organic molecule
Emp. Form.:
C20H19FN4O3
Mol. Mass.:
382.3883
SMILES:
CN1C(N)=N[C@@]2([C@H]3COCC[C@@H]3Oc3ccc(cc23)-c2cccnc2F)C1=O
: