Target
Glucokinase regulatory protein
Ligand
BDBM50447286
Substrate
Meas. Tech.
ChEMBL_1296098 (CHEMBL3131527)
EC50
3640±n/a nM
Citation
 Ashton, KSAndrews, KLBryan, MCBryan, MCChen, JChen, KChen, MChmait, SCroghan, MCupples, RFotsch, CHelmering, JJordan, SRKurzeja, RJMichelsen, KPennington, LDPoon, SFSivits, GVan, GVonderfecht, SLWahl, RCZhang, JLloyd, DJHale, CSt Jean, DJ Small molecule disruptors of the glucokinase-glucokinase regulatory protein interaction: 1. Discovery of a novel tool compound for in vivo proof-of-concept. J Med Chem 57:309-24 (2014)  
Target
Name:
Glucokinase regulatory protein
Synonyms:
GCKR_RAT Glucokinase regulator
Type:
PROTEIN
Mol. Mass.:
68920.17
Organism:
Rattus norvegicus
Description:
ChEMBL_108045
Residue:
627
  
Inhibitor
Name:
BDBM50447286
Synonyms:
CHEMBL3113992
Type:
Small organic molecule
Emp. Form.:
C17H16F6N2O3S2
Mol. Mass.:
474.441
SMILES:
OC(c1ccc(cc1)N1CCN(CC1)S(=O)(=O)c1cccs1)(C(F)(F)F)C(F)(F)F
: