Target
Tissue-type plasminogen activator
Ligand
BDBM50448581
Substrate
Meas. Tech.
ChEMBL_1296325 (CHEMBL3129584)
Ki
1700±n/a nM
Citation
 Quan, MLWong, PCWang, CWoerner, FSmallheer, JMBarbera, FABozarth, JMBrown, RLHarpel, MRLuettgen, JMMorin, PEPeterson, TRamamurthy, VRendina, ARRossi, KAWatson, CAWei, AZhang, GSeiffert, DWexler, RR Tetrahydroquinoline derivatives as potent and selective factor XIa inhibitors. J Med Chem 57:955-69 (2014)  
Target
Name:
Tissue-type plasminogen activator
Synonyms:
Alteplase Reteplase Thrombin receptor protein Tissue-type plasminogen activator (tPA) t-PA t-plasminogen activator
Type:
Enzyme
Mol. Mass.:
62931.08
Organism:
Homo sapiens (Human)
Description:
Residue:
562
  
Inhibitor
Name:
BDBM50448581
Synonyms:
CHEMBL3127463
Type:
Small organic molecule
Emp. Form.:
C36H37N5O4
Mol. Mass.:
603.7101
SMILES:
CC(C)CC(=O)Nc1cc(cc(c1)-c1ccc(cc1C(O)=O)C(N)=O)C1CC(C)(c2ccccc2)c2cc(ccc2N1)C(N)=N
: