Target
Coagulation factor X
Ligand
BDBM50448597
Substrate
Meas. Tech.
ChEMBL_1296330 (CHEMBL3129589)
Ki
606±n/a nM
Citation
 Quan, MLWong, PCWang, CWoerner, FSmallheer, JMBarbera, FABozarth, JMBrown, RLHarpel, MRLuettgen, JMMorin, PEPeterson, TRamamurthy, VRendina, ARRossi, KAWatson, CAWei, AZhang, GSeiffert, DWexler, RR Tetrahydroquinoline derivatives as potent and selective factor XIa inhibitors. J Med Chem 57:955-69 (2014)  
Target
Name:
Coagulation factor X
Synonyms:
Activated coagulation factor X (FXa) Coagulation factor X precursor F10 Factor X heavy chain Factor Xa Stuart-Prower factor
Type:
Enzyme
Mol. Mass.:
54726.60
Organism:
Homo sapiens (Human)
Description:
Residue:
488
  
Inhibitor
Name:
BDBM50448597
Synonyms:
CHEMBL3127477
Type:
Small organic molecule
Emp. Form.:
C32H29N3O4
Mol. Mass.:
519.5904
SMILES:
COC(=O)c1ccc(-c2cccc(c2)[C@@H]2C[C@](C)(c3ccccc3)c3cc(ccc3N2)C(N)=N)c(c1)C(O)=O
: