Target
Coagulation factor XI
Ligand
BDBM50448609
Substrate
Meas. Tech.
ChEMBL_1296332 (CHEMBL3129742)
Ki
110±n/a nM
Citation
 Quan, MLWong, PCWang, CWoerner, FSmallheer, JMBarbera, FABozarth, JMBrown, RLHarpel, MRLuettgen, JMMorin, PEPeterson, TRamamurthy, VRendina, ARRossi, KAWatson, CAWei, AZhang, GSeiffert, DWexler, RR Tetrahydroquinoline derivatives as potent and selective factor XIa inhibitors. J Med Chem 57:955-69 (2014)  
Target
Name:
Coagulation factor XI
Synonyms:
Coagulation factor XIa Coagulation factor XIa light chain FA11_HUMAN Factor XIa PTA | Plasma thromboplastin antecedent
Type:
Enzyme
Mol. Mass.:
70130.58
Organism:
Homo sapiens (Human)
Description:
P03951
Residue:
625
  
Inhibitor
Name:
BDBM50448609
Synonyms:
CHEMBL3127465
Type:
Small organic molecule
Emp. Form.:
C29H25N3O2
Mol. Mass.:
447.5277
SMILES:
NC(=N)c1ccc2N[C@@H](C[C@H](c3ccccc3)c2c1)c1ccccc1-c1ccccc1C(O)=O
: