Target
Coagulation factor X
Ligand
BDBM50448605
Substrate
Meas. Tech.
ChEMBL_1296330 (CHEMBL3129589)
Ki
130±n/a nM
Citation
 Quan, MLWong, PCWang, CWoerner, FSmallheer, JMBarbera, FABozarth, JMBrown, RLHarpel, MRLuettgen, JMMorin, PEPeterson, TRamamurthy, VRendina, ARRossi, KAWatson, CAWei, AZhang, GSeiffert, DWexler, RR Tetrahydroquinoline derivatives as potent and selective factor XIa inhibitors. J Med Chem 57:955-69 (2014)  
Target
Name:
Coagulation factor X
Synonyms:
Activated coagulation factor X (FXa) Coagulation factor X precursor F10 Factor X heavy chain Factor Xa Stuart-Prower factor
Type:
Enzyme
Mol. Mass.:
54726.60
Organism:
Homo sapiens (Human)
Description:
Residue:
488
  
Inhibitor
Name:
BDBM50448605
Synonyms:
CHEMBL3127469
Type:
Small organic molecule
Emp. Form.:
C30H25N3O4
Mol. Mass.:
491.5372
SMILES:
NC(=N)c1ccc2N[C@@H](C[C@H](c3ccccc3)c2c1)c1cccc(c1)-c1ccc(cc1C(O)=O)C(O)=O
: